{"text_format":"1","workbook":"xlsx","n_sheets":14,"sheets":["Finansplan","Omk. & restfinans","Ydelse","Real1","Real2","Real3","Real4","Real5","Lån6","Lån7","Lån8","Lån9","Lån10","Supplerende"],"not_rendered":{"charts":11,"images":4,"macros":1,"external_links":1,"defined_names":134,"comments":14,"pivot_tables":0},"unopened":[],"bounds":{"document_bytes":16777216,"sheet_cells":100000,"rows_first":2000,"rows_last":500,"rows_between":2000,"halvings":0,"cell_chars":16384,"cell_head_chars":4096},"cells_cut":0,"cells_raw":0,"read":"whole","date_system":"1900"}

{"sheet":"Finansplan","index":0,"n_rows":232,"n_cols":44,"rows_kept":232,"cut":false,"hidden":false,"merged":[[15,9,18,9],[25,15,28,15],[109,40,109,41],[15,10,18,10],[15,15,18,15],[15,14,18,14],[15,13,18,13],[15,12,18,12],[15,11,18,11],[25,12,28,12],[25,10,28,10],[25,11,28,11],[25,9,28,9],[25,14,28,14],[43,9,43,10]]}
[null,"Kontantpris og kontant vurdering"]
[null,"Ejendom",null,null,null,null,"Skatte%",null,0.4]
[null,"Alternativ",null,null,null,null,"Kalk.rente p.a.",null,0.05]
[null,"Navn",null,null,null,null,"Kalk.rente/termin",null,{"$f":"(1+I3)^0.25-1","v":1.2272234429039353E-2}]
[null,"Aftalt kontantpris",null,null,null,null,"Realkredit - vurdering og belåningsværdi"]
[null,"Fast ejendom",null,null,null,null,"Fast ejendom",null,"incl. staldinventar, grundforbedr. og alm. driftsbehold."]
{"$rows_left_out":227}
{"sheet":"Omk. & restfinans","index":1,"n_rows":73,"n_cols":24,"rows_kept":73,"cut":false,"hidden":false,"merged":[[4,11,4,14],[52,5,52,6],[14,30,14,31],[15,23,16,23],[15,24,16,24],[15,28,16,28],[15,29,16,29],[15,30,16,30]]}
["Omkostninger, afstemning og aktivering"]
["Ejendom",null,{"$f":"Finansplan!$E2","v":0},null,null,null,null,null,null,null,null,null,null,null,null,"Restgæld, hvor låneomkostninger udgiftsføres år 1"]
["Alternativ",null,{"$f":"Finansplan!$E3","v":0},null,null,null,null,null,null,null,null,null,null,null,null,"Amortiseret kostpris, hvor låneomkostninger amortiseres i renten"]
["Navn",null,{"$f":"Finansplan!$E4","v":0},null,null,null,null,null,null,null,null,null,null,null,null,1," = Amort, hvis 1 = kontant, 2 = amort",null,{"$f":"Amort*2","v":2},"Formelcelle for at aktivere event calculate, når amort skifter"]
["Skødeomkostninger",null,null,null,null,null,"Købers",null,null,null,null,"Afgiftsgrundlag fast ejendom"]
["Ejendomsmægler",null,null,null,"korr","Sats","andel",null,"Køber","Sælger",null,null,null,"Kontantpris",{"$f":"FastEjendomPris","v":0},null,"Hvis BundFastEjendom > Kontantpris så BundFastEjendom ellers hvis kontantpris > Skøn så Kontantpris ellers skøn"]
{"$rows_left_out":68}
{"sheet":"Ydelse","index":2,"n_rows":76,"n_cols":66,"rows_kept":76,"cut":false,"hidden":false,"merged":[[63,49,63,51],[63,54,63,56],[63,59,63,61],[6,22,6,23],[6,31,6,33],[6,25,6,26],[6,28,6,29],[5,22,5,24],[5,31,5,34],[6,19,6,20],[4,19,4,21],[5,19,5,21],[4,22,4,24],[4,31,4,34],[4,25,4,27],[5,25,5,27],[4,28,4,30],[5,28,5,30],[0,1,0,4],[6,13,6,14],[6,1,6,2],[6,7,6,8],[6,4,6,5],[4,1,4,3],[5,1,5,3],[4,7,4,9],[5,7,5,9],[1,2,1,4],[2,2,2,4],[3,2,3,4],[5,4,5,5],[4,4,4,5],[6,16,6,17],[6,10,6,11],[4,10,4,12],[5,10,5,12],[4,13,4,15],[5,13,5,15],[4,16,4,18],[5,16,5,18]]}
[null,"YDELSER",null,null,null,null,null,null,null,null,null,null,null,null,null,null,null,null,null,null,null,null,null,null,null,null,null,null,null,null,null,null,null,null,null,null,"SATS-TABEL"]
[null,"Ejendom",{"$f":"Finansplan!$E2","v":0},null,null,null,null,null,null,null,null,null,null,null,null,null,null,null,null,null,null,null,null,null,null,null,null,null,null,null,null,null,null,null,null,null,"TinglysningPtbr",null,null,1825,"https://domstol.dk/tinglysningsretten/tingboegerne/tinglysningsafgifter/"]
[null,"Alternativ",{"$f":"Finansplan!$E3","v":0},null,null,null,null,null,null,null,null,null,null,null,null,null,null,null,null,null,null,null,null,null,null,null,null,null,null,null,null,null,null,null,null,null,"TinglysningSkoede",null,null,1850]
[null,"Navn",{"$f":"Finansplan!$E4","v":0},null,null,null,null,null,null,null,null,null,null,null,null,null,null,null,null,null,null,null,null,null,null,null,null,null,null,null,null,null,null,null,null,null,"Kursskæring/Indskud",null,null,0.01,"Førhen 1 % af hovedstol, nu i stedet brugt til kursskæring"]
[null,{"$f":"Real1!$D$2","v":"Fast rente 30 år"},null,null,{"$f":"Real2!$D$2","v":"Flexkort"},null,null,{"$f":"Real3!$D$2","v":0},null,null,{"$f":"Real4!$D$2","v":0},null,null,{"$f":"Real5!$D$2","v":0},null,null,{"$f":"Finansplan!$B$30","v":"Banklån"},null,null,{"$f":"Finansplan!$B$31","v":"EIFO"},null,null,{"$f":"Finansplan!$B$32","v":"Etableringslån"},null,null,{"$f":"Finansplan!$B$33","v":"Familielån"},null,null,{"$f":"Finansplan!$B$34","v":"Sælgerpantebrev"},null,null,"I alt",null,null,null,null,"MinStiftelse",null,null,10000]
[null,"Real1",null,null,"Real2",null,null,"Real3",null,null,"Real4",null,null,"Real5",null,null,"Lån6",null,null,"Lån7",null,null,"Lån8",null,null,"Lån9",null,null,"Lån10",null,null,"Alle lån",null,null,null,null,"KurtageGrænse",null,null,3000000]
{"$rows_left_out":71}
{"sheet":"Real1","index":3,"n_rows":205,"n_cols":32,"rows_kept":205,"cut":false,"hidden":false,"merged":[]}
[null,null,null,{"$f":"IF(Amort=2,\"Amortiseret kostpris\",\"\")","v":""},null,null,null,{"$f":"IF(ISBLANK(G1),Finansplan!L20,G1)","v":97.061000000000007},"  kurs",{"$f":"Finansplan!R59","v":"© CHA 29.02.2024"},null,null,null,null,null,{"$f":"IF(AND(ISBLANK(G1),ISBLANK(G2),ISBLANK(G3),ISBLANK(G4),ISBLANK(G5),ISBLANK(G6),ISBLANK(G7),ISBLANK(G8),ISBLANK(G9),ISBLANK(G10),ISBLANK(G32),ISBLANK(G33),ISBLANK(G34),ISBLANK(G35),ISBLANK(G36)),0,1)","v":0}]
[null,null,null,{"$f":"Finansplan!B20","v":"Fast rente 30 år"},null,null,null,{"$f":"IF(ISBLANK(G2),Finansplan!K20,G2)","v":"k"},"  k = kontant-, o = obl.lån"]
[null,null,null,{"$f":"IF(H2=\"k\",\"Kontantlån\",\"Obligationslån\")","v":"Kontantlån"},null,null,null,{"$f":"IF(ISBLANK(G3),Finansplan!J20,G3)","v":"a"},"  a = annuitet, s = serielån"]
[null,null,null,{"$f":"IF(H3=\"s\",\"Serielån\",\"Annuitetslån\")","v":"Annuitetslån"},null,null,null,{"$f":"IF(ISBLANK(G4),Finansplan!I20,G4)","v":0},"  hovedstol / restgæld"]
[null,null,null,{"$f":"IF(H6>0,\"med afdragsfrihed\",\"\")","v":""},null,null,null,{"$f":"IF(ISBLANK(G5),IF(Finansplan!O20<=50,Finansplan!O20,50),IF(G5<=50,G5,50))","v":30},"  års løbetid",{"$f":"IF(G5>50,\"Max 50 år\",\"\")","v":""}]
[null,null,null,{"$f":"IF(H5>30,\"Grafikken viser kun de første 30 år af ydelsen\",\"\")","v":""},null,null,null,{"$f":"IF(ISBLANK(G6),Finansplan!P20,G6)","v":0},"  års afdragsfrihed"]
{"$rows_left_out":200}
{"sheet":"Real2","index":4,"n_rows":205,"n_cols":32,"rows_kept":205,"cut":false,"hidden":false,"merged":[]}
[null,null,null,{"$f":"IF(Amort=2,\"Amortiseret kostpris\",\"\")","v":""},null,null,null,{"$f":"IF(ISBLANK(G1),Finansplan!L21,G1)","v":100.40300000000001},"  kurs",{"$f":"Finansplan!R59","v":"© CHA 29.02.2024"},null,null,null,null,null,{"$f":"IF(AND(ISBLANK(G1),ISBLANK(G2),ISBLANK(G3),ISBLANK(G4),ISBLANK(G5),ISBLANK(G6),ISBLANK(G7),ISBLANK(G8),ISBLANK(G9),ISBLANK(G10),ISBLANK(G32),ISBLANK(G33),ISBLANK(G34),ISBLANK(G35),ISBLANK(G36)),0,1)","v":0}]
[null,null,null,{"$f":"Finansplan!B21","v":"Flexkort"},null,null,null,{"$f":"IF(ISBLANK(G2),Finansplan!K21,G2)","v":"k"},"  k = kontant-, o = obl.lån"]
[null,null,null,{"$f":"IF(H2=\"k\",\"Kontantlån\",\"Obligationslån\")","v":"Kontantlån"},null,null,null,{"$f":"IF(ISBLANK(G3),Finansplan!J21,G3)","v":"a"},"  a = annuitet, s = serielån"]
[null,null,null,{"$f":"IF(H3=\"s\",\"Serielån\",\"Annuitetslån\")","v":"Annuitetslån"},null,null,null,{"$f":"IF(ISBLANK(G4),Finansplan!I21,G4)","v":0},"  hovedstol / restgæld"]
[null,null,null,{"$f":"IF(H6>0,\"med afdragsfrihed\",\"\")","v":"med afdragsfrihed"},null,null,null,{"$f":"IF(ISBLANK(G5),IF(Finansplan!O21<=50,Finansplan!O21,50),IF(G5<=50,G5,50))","v":30},"  års løbetid",{"$f":"IF(G5>50,\"Max 50 år\",\"\")","v":""}]
[null,null,null,{"$f":"IF(H5>30,\"Grafikken viser kun de første 30 år af ydelsen\",\"\")","v":""},null,null,null,{"$f":"IF(ISBLANK(G6),Finansplan!P21,G6)","v":10},"  års afdragsfrihed"]
{"$rows_left_out":200}
{"sheet":"Real3","index":5,"n_rows":204,"n_cols":32,"rows_kept":204,"cut":false,"hidden":false,"merged":[]}
[null,null,null,{"$f":"IF(Amort=2,\"Amortiseret kostpris\",\"\")","v":""},null,null,null,{"$f":"IF(ISBLANK(G1),Finansplan!L22,G1)","v":96},"  kurs",{"$f":"Finansplan!R59","v":"© CHA 29.02.2024"},null,null,null,null,null,{"$f":"IF(AND(ISBLANK(G1),ISBLANK(G2),ISBLANK(G3),ISBLANK(G4),ISBLANK(G5),ISBLANK(G6),ISBLANK(G7),ISBLANK(G8),ISBLANK(G9),ISBLANK(G10),ISBLANK(G32),ISBLANK(G33),ISBLANK(G34),ISBLANK(G35),ISBLANK(G36)),0,1)","v":0}]
[null,null,null,{"$f":"Finansplan!B22","v":0},null,null,null,{"$f":"IF(ISBLANK(G2),Finansplan!K22,G2)","v":"k"},"  k = kontant-, o = obl.lån"]
[null,null,null,{"$f":"IF(H2=\"k\",\"Kontantlån\",\"Obligationslån\")","v":"Kontantlån"},null,null,null,{"$f":"IF(ISBLANK(G3),Finansplan!J22,G3)","v":"a"},"  a = annuitet, s = serielån"]
[null,null,null,{"$f":"IF(H3=\"s\",\"Serielån\",\"Annuitetslån\")","v":"Annuitetslån"},null,null,null,{"$f":"IF(ISBLANK(G4),Finansplan!I22,G4)","v":0},"  hovedstol / restgæld"]
[null,null,null,{"$f":"IF(H6>0,\"med afdragsfrihed\",\"\")","v":""},null,null,null,{"$f":"IF(ISBLANK(G5),IF(Finansplan!O22<=50,Finansplan!O22,50),IF(G5<=50,G5,50))","v":30},"  års løbetid",{"$f":"IF(G5>50,\"Max 50 år\",\"\")","v":""}]
[null,null,null,{"$f":"IF(H5>30,\"Grafikken viser kun de første 30 år af ydelsen\",\"\")","v":""},null,null,null,{"$f":"IF(ISBLANK(G6),Finansplan!P22,G6)","v":0},"  års afdragsfrihed"]
{"$rows_left_out":199}
{"sheet":"Real4","index":6,"n_rows":204,"n_cols":32,"rows_kept":204,"cut":false,"hidden":false,"merged":[]}
[null,null,null,{"$f":"IF(Amort=2,\"Amortiseret kostpris\",\"\")","v":""},null,null,null,{"$f":"IF(ISBLANK(G1),Finansplan!L23,G1)","v":99},"  kurs",{"$f":"Finansplan!R59","v":"© CHA 29.02.2024"},null,null,null,null,null,{"$f":"IF(AND(ISBLANK(G1),ISBLANK(G2),ISBLANK(G3),ISBLANK(G4),ISBLANK(G5),ISBLANK(G6),ISBLANK(G7),ISBLANK(G8),ISBLANK(G9),ISBLANK(G10),ISBLANK(G32),ISBLANK(G33),ISBLANK(G34),ISBLANK(G35),ISBLANK(G36)),0,1)","v":0}]
[null,null,null,{"$f":"Finansplan!B23","v":0},null,null,null,{"$f":"IF(ISBLANK(G2),Finansplan!K23,G2)","v":"o"},"  k = kontant-, o = obl.lån"]
[null,null,null,{"$f":"IF(H2=\"k\",\"Kontantlån\",\"Obligationslån\")","v":"Obligationslån"},null,null,null,{"$f":"IF(ISBLANK(G3),Finansplan!J23,G3)","v":"a"},"  a = annuitet, s = serielån"]
[null,null,null,{"$f":"IF(H3=\"s\",\"Serielån\",\"Annuitetslån\")","v":"Annuitetslån"},null,null,null,{"$f":"IF(ISBLANK(G4),Finansplan!I23,G4)","v":0},"  hovedstol / restgæld"]
[null,null,null,{"$f":"IF(H6>0,\"med afdragsfrihed\",\"\")","v":""},null,null,null,{"$f":"IF(ISBLANK(G5),IF(Finansplan!O23<=50,Finansplan!O23,50),IF(G5<=50,G5,50))","v":30},"  års løbetid",{"$f":"IF(G5>50,\"Max 50 år\",\"\")","v":""}]
[null,null,null,{"$f":"IF(H5>30,\"Grafikken viser kun de første 30 år af ydelsen\",\"\")","v":""},null,null,null,{"$f":"IF(ISBLANK(G6),Finansplan!P23,G6)","v":0},"  års afdragsfrihed"]
{"$rows_left_out":199}
{"sheet":"Real5","index":7,"n_rows":204,"n_cols":32,"rows_kept":204,"cut":false,"hidden":false,"merged":[]}
[null,null,null,{"$f":"IF(Amort=2,\"Amortiseret kostpris\",\"\")","v":""},null,null,null,{"$f":"IF(ISBLANK(G1),Finansplan!L24,G1)","v":98},"  kurs",{"$f":"Finansplan!R59","v":"© CHA 29.02.2024"},null,null,null,null,null,{"$f":"IF(AND(ISBLANK(G1),ISBLANK(G2),ISBLANK(G3),ISBLANK(G4),ISBLANK(G5),ISBLANK(G6),ISBLANK(G7),ISBLANK(G8),ISBLANK(G9),ISBLANK(G10),ISBLANK(G32),ISBLANK(G33),ISBLANK(G34),ISBLANK(G35),ISBLANK(G36)),0,1)","v":0}]
[null,null,null,{"$f":"Finansplan!B24","v":0},null,null,null,{"$f":"IF(ISBLANK(G2),Finansplan!K24,G2)","v":"o"},"  k = kontant-, o = obl.lån"]
[null,null,null,{"$f":"IF(H2=\"k\",\"Kontantlån\",\"Obligationslån\")","v":"Obligationslån"},null,null,null,{"$f":"IF(ISBLANK(G3),Finansplan!J24,G3)","v":"a"},"  a = annuitet, s = serielån"]
[null,null,null,{"$f":"IF(H3=\"s\",\"Serielån\",\"Annuitetslån\")","v":"Annuitetslån"},null,null,null,{"$f":"IF(ISBLANK(G4),Finansplan!I24,G4)","v":0},"  hovedstol / restgæld"]
[null,null,null,{"$f":"IF(H6>0,\"med afdragsfrihed\",\"\")","v":""},null,null,null,{"$f":"IF(ISBLANK(G5),IF(Finansplan!O24<=50,Finansplan!O24,50),IF(G5<=50,G5,50))","v":30},"  års løbetid",{"$f":"IF(G5>50,\"Max 50 år\",\"\")","v":""}]
[null,null,null,{"$f":"IF(H5>30,\"Grafikken viser kun de første 30 år af ydelsen\",\"\")","v":""},null,null,null,{"$f":"IF(ISBLANK(G6),Finansplan!P24,G6)","v":0},"  års afdragsfrihed"]
{"$rows_left_out":199}
{"sheet":"Lån6","index":8,"n_rows":204,"n_cols":32,"rows_kept":204,"cut":false,"hidden":false,"merged":[]}
[null,null,null,{"$f":"IF(Amort=2,\"Amortiseret kostpris\",\"\")","v":""},null,null,null,{"$f":"IF(ISBLANK(G1),Finansplan!L30,G1)","v":100},"  kurs",{"$f":"Finansplan!R59","v":"© CHA 29.02.2024"},null,null,null,null,null,{"$f":"IF(AND(ISBLANK(G1),ISBLANK(G2),ISBLANK(G3),ISBLANK(G4),ISBLANK(G5),ISBLANK(G6),ISBLANK(G7),ISBLANK(G8),ISBLANK(G9),ISBLANK(G10),ISBLANK(G32),ISBLANK(G33),ISBLANK(G34),ISBLANK(G35),ISBLANK(G36)),0,1)","v":0}]
[null,null,null,{"$f":"Finansplan!B30","v":"Banklån"},null,null,null,"o"]
[null,null,null,null,null,null,null,{"$f":"IF(ISBLANK(G3),Finansplan!J30,G3)","v":"a"},"  a = annuitet, s = serielån"]
[null,null,null,{"$f":"IF(H3=\"s\",\"Serielån\",\"Annuitetslån\")","v":"Annuitetslån"},null,null,null,{"$f":"IF(ISBLANK(G4),Finansplan!I30,G4)","v":0},"  hovedstol / restgæld"]
[null,null,null,{"$f":"IF(H6>0,\"med afdragsfrihed\",\"\")","v":""},null,null,null,{"$f":"IF(ISBLANK(G5),IF(Finansplan!O30<=50,Finansplan!O30,50),IF(G5<=50,G5,50))","v":10},"  års løbetid",{"$f":"IF(G5>50,\"Max 50 år\",\"\")","v":""}]
[null,null,null,{"$f":"IF(H5>30,\"Grafikken viser kun de første 30 år af ydelsen\",\"\")","v":""},null,null,null,{"$f":"IF(ISBLANK(G6),Finansplan!P30,G6)","v":0},"  års afdragsfrihed"]
{"$rows_left_out":199}
{"sheet":"Lån7","index":9,"n_rows":204,"n_cols":32,"rows_kept":204,"cut":false,"hidden":false,"merged":[]}
[null,null,null,{"$f":"IF(Amort=2,\"Amortiseret kostpris\",\"\")","v":""},null,null,null,{"$f":"IF(ISBLANK(G1),Finansplan!L31,G1)","v":100},"  kurs",{"$f":"Finansplan!R59","v":"© CHA 29.02.2024"},null,null,null,null,null,{"$f":"IF(AND(ISBLANK(G1),ISBLANK(G2),ISBLANK(G3),ISBLANK(G4),ISBLANK(G5),ISBLANK(G6),ISBLANK(G7),ISBLANK(G8),ISBLANK(G9),ISBLANK(G10),ISBLANK(G32),ISBLANK(G33),ISBLANK(G34),ISBLANK(G35),ISBLANK(G36)),0,1)","v":0}]
[null,null,null,{"$f":"Finansplan!B31","v":"EIFO"},null,null,null,"o"]
[null,null,null,null,null,null,null,{"$f":"IF(ISBLANK(G3),Finansplan!J31,G3)","v":"a"},"  a = annuitet, s = serielån"]
[null,null,null,{"$f":"IF(H3=\"s\",\"Serielån\",\"Annuitetslån\")","v":"Annuitetslån"},null,null,null,{"$f":"IF(ISBLANK(G4),Finansplan!I31,G4)","v":0},"  hovedstol / restgæld"]
[null,null,null,{"$f":"IF(H6>0,\"med afdragsfrihed\",\"\")","v":""},null,null,null,{"$f":"IF(ISBLANK(G5),IF(Finansplan!O31<=50,Finansplan!O31,50),IF(G5<=50,G5,50))","v":10},"  års løbetid",{"$f":"IF(G5>50,\"Max 50 år\",\"\")","v":""}]
[null,null,null,{"$f":"IF(H5>30,\"Grafikken viser kun de første 30 år af ydelsen\",\"\")","v":""},null,null,null,{"$f":"IF(ISBLANK(G6),Finansplan!P31,G6)","v":0},"  års afdragsfrihed"]
{"$rows_left_out":199}
{"sheet":"Lån8","index":10,"n_rows":204,"n_cols":32,"rows_kept":204,"cut":false,"hidden":false,"merged":[]}
[null,null,null,{"$f":"IF(Amort=2,\"Amortiseret kostpris\",\"\")","v":""},null,null,null,{"$f":"IF(ISBLANK(G1),Finansplan!L32,G1)","v":100},"  kurs",{"$f":"Finansplan!R59","v":"© CHA 29.02.2024"},null,null,null,null,null,{"$f":"IF(AND(ISBLANK(G1),ISBLANK(G2),ISBLANK(G3),ISBLANK(G4),ISBLANK(G5),ISBLANK(G6),ISBLANK(G7),ISBLANK(G8),ISBLANK(G9),ISBLANK(G10),ISBLANK(G32),ISBLANK(G33),ISBLANK(G34),ISBLANK(G35),ISBLANK(G36)),0,1)","v":0}]
[null,null,null,{"$f":"Finansplan!B32","v":"Etableringslån"},null,null,null,"o"]
[null,null,null,null,null,null,null,{"$f":"IF(ISBLANK(G3),Finansplan!J32,G3)","v":"a"},"  a = annuitet, s = serielån"]
[null,null,null,{"$f":"IF(H3=\"s\",\"Serielån\",\"Annuitetslån\")","v":"Annuitetslån"},null,null,null,{"$f":"IF(ISBLANK(G4),Finansplan!I32,G4)","v":0},"  hovedstol / restgæld"]
[null,null,null,{"$f":"IF(H6>0,\"med afdragsfrihed\",\"\")","v":""},null,null,null,{"$f":"IF(ISBLANK(G5),IF(Finansplan!O32<=50,Finansplan!O32,50),IF(G5<=50,G5,50))","v":15},"  års løbetid",{"$f":"IF(G5>50,\"Max 50 år\",\"\")","v":""}]
[null,null,null,{"$f":"IF(H5>30,\"Grafikken viser kun de første 30 år af ydelsen\",\"\")","v":""},null,null,null,{"$f":"IF(ISBLANK(G6),Finansplan!P32,G6)","v":0},"  års afdragsfrihed"]
{"$rows_left_out":199}
{"sheet":"Lån9","index":11,"n_rows":204,"n_cols":32,"rows_kept":204,"cut":false,"hidden":false,"merged":[]}
[null,null,null,{"$f":"IF(Amort=2,\"Amortiseret kostpris\",\"\")","v":""},null,null,null,{"$f":"IF(ISBLANK(G1),Finansplan!L33,G1)","v":100},"  kurs",{"$f":"Finansplan!R59","v":"© CHA 29.02.2024"},null,null,null,null,null,{"$f":"IF(AND(ISBLANK(G1),ISBLANK(G2),ISBLANK(G3),ISBLANK(G4),ISBLANK(G5),ISBLANK(G6),ISBLANK(G7),ISBLANK(G8),ISBLANK(G9),ISBLANK(G10),ISBLANK(G32),ISBLANK(G33),ISBLANK(G34),ISBLANK(G35),ISBLANK(G36)),0,1)","v":0}]
[null,null,null,{"$f":"Finansplan!B33","v":"Familielån"},null,null,null,"o"]
[null,null,null,null,null,null,null,{"$f":"IF(ISBLANK(G3),Finansplan!J33,G3)","v":"a"},"  a = annuitet, s = serielån"]
[null,null,null,{"$f":"IF(H3=\"s\",\"Serielån\",\"Annuitetslån\")","v":"Annuitetslån"},null,null,null,{"$f":"IF(ISBLANK(G4),Finansplan!I33,G4)","v":0},"  hovedstol / restgæld"]
[null,null,null,{"$f":"IF(H6>0,\"med afdragsfrihed\",\"\")","v":""},null,null,null,{"$f":"IF(ISBLANK(G5),IF(Finansplan!O33<=50,Finansplan!O33,50),IF(G5<=50,G5,50))","v":30},"  års løbetid",{"$f":"IF(G5>50,\"Max 50 år\",\"\")","v":""}]
[null,null,null,{"$f":"IF(H5>30,\"Grafikken viser kun de første 30 år af ydelsen\",\"\")","v":""},null,null,null,{"$f":"IF(ISBLANK(G6),Finansplan!P33,G6)","v":0},"  års afdragsfrihed"]
{"$rows_left_out":199}
{"sheet":"Lån10","index":12,"n_rows":204,"n_cols":32,"rows_kept":204,"cut":false,"hidden":false,"merged":[]}
[null,null,null,{"$f":"IF(Amort=2,\"Amortiseret kostpris\",\"\")","v":""},null,null,null,{"$f":"IF(ISBLANK(G1),Finansplan!L34,G1)","v":85},"  kurs",{"$f":"Finansplan!R59","v":"© CHA 29.02.2024"},null,null,null,null,null,{"$f":"IF(AND(ISBLANK(G1),ISBLANK(G2),ISBLANK(G3),ISBLANK(G4),ISBLANK(G5),ISBLANK(G6),ISBLANK(G7),ISBLANK(G8),ISBLANK(G9),ISBLANK(G10),ISBLANK(G32),ISBLANK(G33),ISBLANK(G34),ISBLANK(G35),ISBLANK(G36)),0,1)","v":0}]
[null,null,null,{"$f":"Finansplan!B34","v":"Sælgerpantebrev"},null,null,null,"o"]
[null,null,null,null,null,null,null,{"$f":"IF(ISBLANK(G3),Finansplan!J34,G3)","v":"a"},"  a = annuitet, s = serielån"]
[null,null,null,{"$f":"IF(H3=\"s\",\"Serielån\",\"Annuitetslån\")","v":"Annuitetslån"},null,null,null,{"$f":"IF(ISBLANK(G4),Finansplan!I34,G4)","v":0},"  hovedstol / restgæld"]
[null,null,null,{"$f":"IF(H6>0,\"med afdragsfrihed\",\"\")","v":""},null,null,null,{"$f":"IF(ISBLANK(G5),IF(Finansplan!O34<=50,Finansplan!O34,50),IF(G5<=50,G5,50))","v":10},"  års løbetid",{"$f":"IF(G5>50,\"Max 50 år\",\"\")","v":""}]
[null,null,null,{"$f":"IF(H5>30,\"Grafikken viser kun de første 30 år af ydelsen\",\"\")","v":""},null,null,null,{"$f":"IF(ISBLANK(G6),Finansplan!P34,G6)","v":0},"  års afdragsfrihed"]
{"$rows_left_out":199}
{"sheet":"Supplerende","index":13,"n_rows":44,"n_cols":21,"rows_kept":44,"cut":false,"hidden":false,"merged":[]}
[null,"Vurdering, investering og merværdi",null,null,null,null,null,null,null,"Ejendom",null,{"$f":"Finansplan!E2","v":0}]
[null,"Investeringen foretages ",null,null,6," terminer efter overtagelse",null,null,null,"Alternativ",null,{"$f":"Finansplan!E3","v":0}]
[null,"Realkreditafdrag",null,null,{"$f":"VLOOKUP($E$2,Finansplan!$AC$113:$AR$243,14)","v":0}," år til dato",null,null,null,"Navn",null,{"$f":"Finansplan!E4","v":0}]
[]
[null,"Realkredit - vurdering fra ejerskifte",null,null,null,null,null,null,"Investering",null,null,"Merværdi",null,"Realkredit - vurdering incl merværdi"]
[null,"Fast ejendom",null,"inkl. staldinventar og driftsbeholdninger",null,null,{"$f":"Finansplan!N6","v":0},null,"Fast ejendom/bygn.",null,null,0.75,{"$f":"K6*L6","v":0},"Fast ejendom",null,null,{"$f":"G6+M6+M9","v":0}," inkl. staldinventar"]
{"$rows_left_out":38}